2026-08-20T09:29:19+02:00 ==== DEPLOY (Next.js) START (user=root) ====
2026-08-20T09:29:19+02:00 No .deploy_env at /home/yousystemsnet/public_html/.deploy_env (will try SSH git pull without password prompt)
2026-08-20T09:29:19+02:00 git pull origin staging (SSH/key)
From https://codemania.yousystems.com/zulqarnain/coporatebackend_nextjs
 * branch              staging    -> FETCH_HEAD
Already up to date.
2026-08-20T09:29:22+02:00 ==== NEXTJS BUILD START (/home/yousystemsnet/public_html) ====

added 209 packages, and audited 210 packages in 10s

21 packages are looking for funding
  run `npm fund` for details

3 high severity vulnerabilities

To address all issues, run:
  npm audit fix

Run `npm audit` for details.

> coporatebackend_nextjs@0.1.0 build
> next build

▲ Next.js 16.2.12 (Turbopack)
- Environments: .env.production
- Experiments (use with caution):
  · proxyClientMaxBodySize: "100mb"
  · serverActions

  Creating an optimized production build ...

> Build error occurred
Error: Turbopack build failed with 3 errors:
./app/globals.css
Error evaluating Node.js code
Error: Cannot find module '@tailwindcss/postcss'
Require stack:
- /home/yousystemsnet/public_html/.next/build/chunks/[root-of-the-server]__0oj80bi._.js
- /home/yousystemsnet/public_html/.next/build/chunks/[turbopack]_runtime.js
- /home/yousystemsnet/public_html/.next/build/56416d4ae4ce586f.js
    [at Module._resolveFilename (node:internal/modules/cjs/loader:1207:15)]
    [at Module._load (node:internal/modules/cjs/loader:1038:27)]
    [at Module.require (node:internal/modules/cjs/loader:1289:19)]
    [at require (node:internal/modules/helpers:182:18)]
    at require (turbopack:///[turbopack-node]/transforms/postcss.ts:49:25) [/home/yousystemsnet/public_html/.next/build/chunks/[root-of-the-server]__0oj80bi._.js:134:33]
    [at <anonymous>]
    at map (turbopack:///[turbopack-node]/transforms/postcss.ts:43:33) [/home/yousystemsnet/public_html/.next/build/chunks/[root-of-the-server]__0oj80bi._.js:129:35]
    at init (turbopack:///[turbopack-node]/child_process/evaluate.ts:74:20) [/home/yousystemsnet/public_html/.next/build/chunks/[root-of-the-server]__1f933tp._.js:429:26]
    [at process.processTicksAndRejections (node:internal/process/task_queues:95:5)]

Import trace:
  Client Component Browser:
    ./app/globals.css [Client Component Browser]
    ./app/layout.tsx [Server Component]


./node_modules/react-grid-layout/css/styles.css
Error evaluating Node.js code
Error: Cannot find module '@tailwindcss/postcss'
Require stack:
- /home/yousystemsnet/public_html/.next/build/chunks/[root-of-the-server]__0oj80bi._.js
- /home/yousystemsnet/public_html/.next/build/chunks/[turbopack]_runtime.js
- /home/yousystemsnet/public_html/.next/build/56416d4ae4ce586f.js
    [at Module._resolveFilename (node:internal/modules/cjs/loader:1207:15)]
    [at Module._load (node:internal/modules/cjs/loader:1038:27)]
    [at Module.require (node:internal/modules/cjs/loader:1289:19)]
    [at require (node:internal/modules/helpers:182:18)]
    at require (turbopack:///[turbopack-node]/transforms/postcss.ts:49:25) [/home/yousystemsnet/public_html/.next/build/chunks/[root-of-the-server]__0oj80bi._.js:134:33]
    [at <anonymous>]
    at map (turbopack:///[turbopack-node]/transforms/postcss.ts:43:33) [/home/yousystemsnet/public_html/.next/build/chunks/[root-of-the-server]__0oj80bi._.js:129:35]
    at init (turbopack:///[turbopack-node]/child_process/evaluate.ts:74:20) [/home/yousystemsnet/public_html/.next/build/chunks/[root-of-the-server]__1f933tp._.js:429:26]
    [at process.processTicksAndRejections (node:internal/process/task_queues:95:5)]

Import trace:
  Client Component Browser:
    ./node_modules/react-grid-layout/css/styles.css [Client Component Browser]
    ./app/customer/_components/dashboard-layout-shell.tsx [Client Component Browser]
    ./app/customer/_components/dashboard-widget-host.tsx [Client Component Browser]
    ./app/customer/_components/dashboard-overview.tsx [Client Component Browser]
    ./app/customer/_components/dashboard-overview.tsx [Server Component]
    ./app/customer/[tenant]/dashboard/page.tsx [Server Component]


./node_modules/react-resizable/css/styles.css
Error evaluating Node.js code
Error: Cannot find module '@tailwindcss/postcss'
Require stack:
- /home/yousystemsnet/public_html/.next/build/chunks/[root-of-the-server]__0oj80bi._.js
- /home/yousystemsnet/public_html/.next/build/chunks/[turbopack]_runtime.js
- /home/yousystemsnet/public_html/.next/build/56416d4ae4ce586f.js
    [at Module._resolveFilename (node:internal/modules/cjs/loader:1207:15)]
    [at Module._load (node:internal/modules/cjs/loader:1038:27)]
    [at Module.require (node:internal/modules/cjs/loader:1289:19)]
    [at require (node:internal/modules/helpers:182:18)]
    at require (turbopack:///[turbopack-node]/transforms/postcss.ts:49:25) [/home/yousystemsnet/public_html/.next/build/chunks/[root-of-the-server]__0oj80bi._.js:134:33]
    [at <anonymous>]
    at map (turbopack:///[turbopack-node]/transforms/postcss.ts:43:33) [/home/yousystemsnet/public_html/.next/build/chunks/[root-of-the-server]__0oj80bi._.js:129:35]
    at init (turbopack:///[turbopack-node]/child_process/evaluate.ts:74:20) [/home/yousystemsnet/public_html/.next/build/chunks/[root-of-the-server]__1f933tp._.js:429:26]
    [at process.processTicksAndRejections (node:internal/process/task_queues:95:5)]

Import trace:
  Client Component Browser:
    ./node_modules/react-resizable/css/styles.css [Client Component Browser]
    ./app/customer/_components/dashboard-layout-shell.tsx [Client Component Browser]
    ./app/customer/_components/dashboard-widget-host.tsx [Client Component Browser]
    ./app/customer/_components/dashboard-overview.tsx [Client Component Browser]
    ./app/customer/_components/dashboard-overview.tsx [Server Component]
    ./app/customer/[tenant]/dashboard/page.tsx [Server Component]


    at require (turbopack:///[turbopack-node]/transforms/postcss.ts:49:25) [/home/yousystemsnet/public_html/.next/build/chunks/[root-of-the-server]__0oj80bi._.js:134:33])
    at map (turbopack:///[turbopack-node]/transforms/postcss.ts:43:33) [/home/yousystemsnet/public_html/.next/build/chunks/[root-of-the-server]__0oj80bi._.js:129:35])
    at init (turbopack:///[turbopack-node]/child_process/evaluate.ts:74:20) [/home/yousystemsnet/public_html/.next/build/chunks/[root-of-the-server]__1f933tp._.js:429:26])
    at require (turbopack:///[turbopack-node]/transforms/postcss.ts:49:25) [/home/yousystemsnet/public_html/.next/build/chunks/[root-of-the-server]__0oj80bi._.js:134:33])
    at map (turbopack:///[turbopack-node]/transforms/postcss.ts:43:33) [/home/yousystemsnet/public_html/.next/build/chunks/[root-of-the-server]__0oj80bi._.js:129:35])
    at init (turbopack:///[turbopack-node]/child_process/evaluate.ts:74:20) [/home/yousystemsnet/public_html/.next/build/chunks/[root-of-the-server]__1f933tp._.js:429:26])
    at require (turbopack:///[turbopack-node]/transforms/postcss.ts:49:25) [/home/yousystemsnet/public_html/.next/build/chunks/[root-of-the-server]__0oj80bi._.js:134:33])
    at map (turbopack:///[turbopack-node]/transforms/postcss.ts:43:33) [/home/yousystemsnet/public_html/.next/build/chunks/[root-of-the-server]__0oj80bi._.js:129:35])
    at init (turbopack:///[turbopack-node]/child_process/evaluate.ts:74:20) [/home/yousystemsnet/public_html/.next/build/chunks/[root-of-the-server]__1f933tp._.js:429:26])
2026-08-20T09:29:52+02:00 ERROR: NEXTJS_BUILD_CMD failed
2026-08-20T09:29:52+02:00 ==== DEPLOY FAILED (Next.js) ====
2026-09-14T16:58:37+02:00 ==== DEPLOY (Next.js) START (user=root app=/home/yousystemsnet/public_html branch=staging) ====
2026-09-14T16:58:37+02:00 git pull origin staging (SSH/key)
fatal: could not read Username for 'https://codemania.yousystems.com': No such device or address
2026-09-14T16:58:37+02:00 ERROR: git pull failed (see last lines in /home/yousystemsnet/public_html/deploy.log)
2026-09-14T16:58:37+02:00 ==== DEPLOY FAILED (Next.js) ====
2026-09-15T09:22:49+02:00 ==== DEPLOY (Next.js) START (user=root app=/home/yousystemsnet/public_html branch=staging) ====
2026-09-15T09:22:49+02:00 git pull origin staging (SSH/key)
fatal: could not read Username for 'https://codemania.yousystems.com': No such device or address
2026-09-15T09:22:49+02:00 ERROR: git pull failed (see last lines in /home/yousystemsnet/public_html/deploy.log)
2026-09-15T09:22:49+02:00 ==== DEPLOY FAILED (Next.js) ====
2026-09-15T09:30:50+02:00 ==== DEPLOY (Next.js) START (user=root app=/home/yousystemsnet/public_html branch=staging) ====
2026-09-15T09:30:50+02:00 git pull origin staging (SSH/key)
fatal: could not read Username for 'https://codemania.yousystems.com': No such device or address
2026-09-15T09:30:50+02:00 ERROR: git pull failed (see last lines in /home/yousystemsnet/public_html/deploy.log)
2026-09-15T09:30:50+02:00 ==== DEPLOY FAILED (Next.js) ====
2026-09-15T15:52:08+02:00 ==== DEPLOY (Next.js) START (user=root app=/home/yousystemsnet/public_html branch=staging) ====
2026-09-15T15:52:08+02:00 git pull origin staging (SSH/key)
fatal: could not read Username for 'https://codemania.yousystems.com': No such device or address
2026-09-15T15:52:08+02:00 ERROR: git pull failed (see last lines in /home/yousystemsnet/public_html/deploy.log)
2026-09-15T15:52:08+02:00 ==== DEPLOY FAILED (Next.js) ====
2026-09-16T14:04:16+02:00 ==== DEPLOY (Next.js) START (user=root app=/home/yousystemsnet/public_html branch=staging) ====
2026-09-16T14:04:16+02:00 git pull origin staging (SSH/key)
fatal: could not read Username for 'https://codemania.yousystems.com': No such device or address
2026-09-16T14:04:16+02:00 ERROR: git pull failed (see last lines in /home/yousystemsnet/public_html/deploy.log)
2026-09-16T14:04:16+02:00 ==== DEPLOY FAILED (Next.js) ====
2026-09-16T15:25:09+02:00 ==== DEPLOY (Next.js) START (user=root app=/home/yousystemsnet/public_html branch=staging) ====
2026-09-16T15:25:09+02:00 git pull origin staging (SSH/key)
fatal: could not read Username for 'https://codemania.yousystems.com': No such device or address
2026-09-16T15:25:09+02:00 ERROR: git pull failed (see last lines in /home/yousystemsnet/public_html/deploy.log)
2026-09-16T15:25:09+02:00 ==== DEPLOY FAILED (Next.js) ====
2026-09-17T08:57:08+02:00 ==== DEPLOY (Next.js) START (user=root app=/home/yousystemsnet/public_html branch=staging) ====
2026-09-17T08:57:08+02:00 git pull origin staging (SSH/key)
fatal: could not read Username for 'https://codemania.yousystems.com': No such device or address
2026-09-17T08:57:08+02:00 ERROR: git pull failed (see last lines in /home/yousystemsnet/public_html/deploy.log)
2026-09-17T08:57:08+02:00 ==== DEPLOY FAILED (Next.js) ====
2026-09-17T15:30:58+02:00 ==== DEPLOY (Next.js) START (user=root app=/home/yousystemsnet/public_html branch=staging) ====
2026-09-17T15:30:58+02:00 git pull origin staging (SSH/key)
fatal: could not read Username for 'https://codemania.yousystems.com': No such device or address
2026-09-17T15:30:58+02:00 ERROR: git pull failed (see last lines in /home/yousystemsnet/public_html/deploy.log)
2026-09-17T15:30:58+02:00 ==== DEPLOY FAILED (Next.js) ====
2026-09-18T09:10:15+02:00 ==== DEPLOY (Next.js) START (user=root app=/home/yousystemsnet/public_html branch=staging) ====
2026-09-18T09:10:15+02:00 git pull origin staging (SSH/key)
fatal: could not read Username for 'https://codemania.yousystems.com': No such device or address
2026-09-18T09:10:15+02:00 ERROR: git pull failed (see last lines in /home/yousystemsnet/public_html/deploy.log)
2026-09-18T09:10:15+02:00 ==== DEPLOY FAILED (Next.js) ====
2026-09-19T11:50:47+02:00 ==== DEPLOY (Next.js) START (user=root app=/home/yousystemsnet/public_html branch=staging) ====
2026-09-19T11:50:47+02:00 git pull origin staging (SSH/key)
fatal: could not read Username for 'https://codemania.yousystems.com': No such device or address
2026-09-19T11:50:47+02:00 ERROR: git pull failed (see last lines in /home/yousystemsnet/public_html/deploy.log)
2026-09-19T11:50:47+02:00 ==== DEPLOY FAILED (Next.js) ====
2026-09-21T09:24:47+02:00 ==== DEPLOY (Next.js) START (user=root app=/home/yousystemsnet/public_html branch=staging) ====
2026-09-21T09:24:47+02:00 git pull origin staging (SSH/key)
fatal: could not read Username for 'https://codemania.yousystems.com': No such device or address
2026-09-21T09:24:48+02:00 ERROR: git pull failed (see last lines in /home/yousystemsnet/public_html/deploy.log)
2026-09-21T09:24:48+02:00 ==== DEPLOY FAILED (Next.js) ====
2026-09-21T11:32:37+02:00 ==== DEPLOY (Next.js) START (user=root app=/home/yousystemsnet/public_html branch=staging) ====
2026-09-21T11:32:37+02:00 git pull origin staging (SSH/key)
fatal: could not read Username for 'https://codemania.yousystems.com': No such device or address
2026-09-21T11:32:37+02:00 ERROR: git pull failed (see last lines in /home/yousystemsnet/public_html/deploy.log)
2026-09-21T11:32:37+02:00 ==== DEPLOY FAILED (Next.js) ====
2026-09-21T13:34:30+02:00 ==== DEPLOY (Next.js) START (user=root app=/home/yousystemsnet/public_html branch=staging) ====
2026-09-21T13:34:30+02:00 git pull origin staging (SSH/key)
fatal: could not read Username for 'https://codemania.yousystems.com': No such device or address
2026-09-21T13:34:30+02:00 ERROR: git pull failed (see last lines in /home/yousystemsnet/public_html/deploy.log)
2026-09-21T13:34:30+02:00 ==== DEPLOY FAILED (Next.js) ====
2026-09-21T14:26:31+02:00 ==== DEPLOY (Next.js) START (user=root app=/home/yousystemsnet/public_html branch=staging) ====
2026-09-21T14:26:31+02:00 git pull origin staging (SSH/key)
fatal: could not read Username for 'https://codemania.yousystems.com': No such device or address
2026-09-21T14:26:31+02:00 ERROR: git pull failed (see last lines in /home/yousystemsnet/public_html/deploy.log)
2026-09-21T14:26:31+02:00 ==== DEPLOY FAILED (Next.js) ====
2026-09-21T16:13:40+02:00 ==== DEPLOY (Next.js) START (user=root app=/home/yousystemsnet/public_html branch=staging) ====
2026-09-21T16:13:40+02:00 git pull origin staging (SSH/key)
fatal: could not read Username for 'https://codemania.yousystems.com': No such device or address
2026-09-21T16:13:40+02:00 ERROR: git pull failed (see last lines in /home/yousystemsnet/public_html/deploy.log)
2026-09-21T16:13:40+02:00 ==== DEPLOY FAILED (Next.js) ====
2026-09-22T07:46:13+02:00 ==== DEPLOY (Next.js) START (user=root app=/home/yousystemsnet/public_html branch=staging) ====
2026-09-22T07:46:13+02:00 git pull origin staging (SSH/key)
fatal: could not read Username for 'https://codemania.yousystems.com': No such device or address
2026-09-22T07:46:13+02:00 ERROR: git pull failed (see last lines in /home/yousystemsnet/public_html/deploy.log)
2026-09-22T07:46:13+02:00 ==== DEPLOY FAILED (Next.js) ====
2026-09-22T09:08:18+02:00 ==== DEPLOY (Next.js) START (user=root app=/home/yousystemsnet/public_html branch=staging) ====
2026-09-22T09:08:18+02:00 git pull origin staging (SSH/key)
fatal: could not read Username for 'https://codemania.yousystems.com': No such device or address
2026-09-22T09:08:18+02:00 ERROR: git pull failed (see last lines in /home/yousystemsnet/public_html/deploy.log)
2026-09-22T09:08:18+02:00 ==== DEPLOY FAILED (Next.js) ====
2026-09-22T09:26:56+02:00 ==== DEPLOY (Next.js) START (user=root app=/home/yousystemsnet/public_html branch=staging) ====
2026-09-22T09:26:56+02:00 git pull origin staging (SSH/key)
fatal: could not read Username for 'https://codemania.yousystems.com': No such device or address
2026-09-22T09:26:56+02:00 ERROR: git pull failed (see last lines in /home/yousystemsnet/public_html/deploy.log)
2026-09-22T09:26:56+02:00 ==== DEPLOY FAILED (Next.js) ====
2026-09-22T09:34:21+02:00 ==== DEPLOY (Next.js) START (user=root app=/home/yousystemsnet/public_html branch=staging) ====
2026-09-22T09:34:21+02:00 git pull origin staging (SSH/key)
fatal: could not read Username for 'https://codemania.yousystems.com': No such device or address
2026-09-22T09:34:21+02:00 ERROR: git pull failed (see last lines in /home/yousystemsnet/public_html/deploy.log)
2026-09-22T09:34:21+02:00 ==== DEPLOY FAILED (Next.js) ====
2026-09-22T10:40:15+02:00 ==== DEPLOY (Next.js) START (user=root app=/home/yousystemsnet/public_html branch=staging) ====
2026-09-22T10:40:15+02:00 git pull origin staging (SSH/key)
fatal: could not read Username for 'https://codemania.yousystems.com': No such device or address
2026-09-22T10:40:15+02:00 ERROR: git pull failed (see last lines in /home/yousystemsnet/public_html/deploy.log)
2026-09-22T10:40:15+02:00 ==== DEPLOY FAILED (Next.js) ====
2026-09-22T15:05:00+02:00 ==== DEPLOY (Next.js) START (user=root app=/home/yousystemsnet/public_html branch=staging) ====
2026-09-22T15:05:00+02:00 git pull origin staging (SSH/key)
fatal: could not read Username for 'https://codemania.yousystems.com': No such device or address
2026-09-22T15:05:00+02:00 ERROR: git pull failed (see last lines in /home/yousystemsnet/public_html/deploy.log)
2026-09-22T15:05:00+02:00 ==== DEPLOY FAILED (Next.js) ====
2026-09-22T15:17:27+02:00 ==== DEPLOY (Next.js) START (user=root app=/home/yousystemsnet/public_html branch=staging) ====
2026-09-22T15:17:27+02:00 git pull origin staging (SSH/key)
fatal: could not read Username for 'https://codemania.yousystems.com': No such device or address
2026-09-22T15:17:27+02:00 ERROR: git pull failed (see last lines in /home/yousystemsnet/public_html/deploy.log)
2026-09-22T15:17:27+02:00 ==== DEPLOY FAILED (Next.js) ====
2026-09-23T08:42:57+02:00 ==== DEPLOY (Next.js) START (user=root app=/home/yousystemsnet/public_html branch=staging) ====
2026-09-23T08:42:57+02:00 git pull origin staging (SSH/key)
fatal: could not read Username for 'https://codemania.yousystems.com': No such device or address
2026-09-23T08:42:57+02:00 ERROR: git pull failed (see last lines in /home/yousystemsnet/public_html/deploy.log)
2026-09-23T08:42:57+02:00 ==== DEPLOY FAILED (Next.js) ====
2026-09-23T09:41:17+02:00 ==== DEPLOY (Next.js) START (user=root app=/home/yousystemsnet/public_html branch=staging) ====
2026-09-23T09:41:17+02:00 git pull origin staging (SSH/key)
fatal: could not read Username for 'https://codemania.yousystems.com': No such device or address
2026-09-23T09:41:17+02:00 ERROR: git pull failed (see last lines in /home/yousystemsnet/public_html/deploy.log)
2026-09-23T09:41:17+02:00 ==== DEPLOY FAILED (Next.js) ====
2026-09-23T11:00:36+02:00 ==== DEPLOY (Next.js) START (user=root app=/home/yousystemsnet/public_html branch=staging) ====
2026-09-23T11:00:36+02:00 git pull origin staging (SSH/key)
fatal: could not read Username for 'https://codemania.yousystems.com': No such device or address
2026-09-23T11:00:36+02:00 ERROR: git pull failed (see last lines in /home/yousystemsnet/public_html/deploy.log)
2026-09-23T11:00:36+02:00 ==== DEPLOY FAILED (Next.js) ====
2026-09-23T14:31:35+02:00 ==== DEPLOY (Next.js) START (user=root app=/home/yousystemsnet/public_html branch=staging) ====
2026-09-23T14:31:35+02:00 git pull origin staging (SSH/key)
fatal: could not read Username for 'https://codemania.yousystems.com': No such device or address
2026-09-23T14:31:35+02:00 ERROR: git pull failed (see last lines in /home/yousystemsnet/public_html/deploy.log)
2026-09-23T14:31:35+02:00 ==== DEPLOY FAILED (Next.js) ====
2026-09-23T15:31:27+02:00 ==== DEPLOY (Next.js) START (user=root app=/home/yousystemsnet/public_html branch=staging) ====
2026-09-23T15:31:27+02:00 git pull origin staging (SSH/key)
fatal: could not read Username for 'https://codemania.yousystems.com': No such device or address
2026-09-23T15:31:27+02:00 ERROR: git pull failed (see last lines in /home/yousystemsnet/public_html/deploy.log)
2026-09-23T15:31:27+02:00 ==== DEPLOY FAILED (Next.js) ====
2026-09-23T16:04:55+02:00 ==== DEPLOY (Next.js) START (user=root app=/home/yousystemsnet/public_html branch=staging) ====
2026-09-23T16:04:55+02:00 git pull origin staging (SSH/key)
fatal: could not read Username for 'https://codemania.yousystems.com': No such device or address
2026-09-23T16:04:55+02:00 ERROR: git pull failed (see last lines in /home/yousystemsnet/public_html/deploy.log)
2026-09-23T16:04:55+02:00 ==== DEPLOY FAILED (Next.js) ====
2026-09-23T16:19:30+02:00 ==== DEPLOY (Next.js) START (user=root app=/home/yousystemsnet/public_html branch=staging) ====
2026-09-23T16:19:30+02:00 git pull origin staging (SSH/key)
fatal: could not read Username for 'https://codemania.yousystems.com': No such device or address
2026-09-23T16:19:30+02:00 ERROR: git pull failed (see last lines in /home/yousystemsnet/public_html/deploy.log)
2026-09-23T16:19:30+02:00 ==== DEPLOY FAILED (Next.js) ====
2026-09-24T09:34:48+02:00 ==== DEPLOY (Next.js) START (user=root app=/home/yousystemsnet/public_html branch=staging) ====
2026-09-24T09:34:48+02:00 git pull origin staging (SSH/key)
fatal: could not read Username for 'https://codemania.yousystems.com': No such device or address
2026-09-24T09:34:48+02:00 ERROR: git pull failed (see last lines in /home/yousystemsnet/public_html/deploy.log)
2026-09-24T09:34:48+02:00 ==== DEPLOY FAILED (Next.js) ====
2026-09-24T10:36:29+02:00 ==== DEPLOY (Next.js) START (user=root app=/home/yousystemsnet/public_html branch=staging) ====
2026-09-24T10:36:29+02:00 git pull origin staging (SSH/key)
fatal: could not read Username for 'https://codemania.yousystems.com': No such device or address
2026-09-24T10:36:29+02:00 ERROR: git pull failed (see last lines in /home/yousystemsnet/public_html/deploy.log)
2026-09-24T10:36:29+02:00 ==== DEPLOY FAILED (Next.js) ====
2026-09-24T13:18:54+02:00 ==== DEPLOY (Next.js) START (user=root app=/home/yousystemsnet/public_html branch=staging) ====
2026-09-24T13:18:54+02:00 git pull origin staging (SSH/key)
fatal: could not read Username for 'https://codemania.yousystems.com': No such device or address
2026-09-24T13:18:54+02:00 ERROR: git pull failed (see last lines in /home/yousystemsnet/public_html/deploy.log)
2026-09-24T13:18:54+02:00 ==== DEPLOY FAILED (Next.js) ====
2026-09-24T14:09:50+02:00 ==== DEPLOY (Next.js) START (user=root app=/home/yousystemsnet/public_html branch=staging) ====
2026-09-24T14:09:50+02:00 git pull origin staging (SSH/key)
fatal: could not read Username for 'https://codemania.yousystems.com': No such device or address
2026-09-24T14:09:50+02:00 ERROR: git pull failed (see last lines in /home/yousystemsnet/public_html/deploy.log)
2026-09-24T14:09:50+02:00 ==== DEPLOY FAILED (Next.js) ====
2026-09-24T15:46:45+02:00 ==== DEPLOY (Next.js) START (user=root app=/home/yousystemsnet/public_html branch=staging) ====
2026-09-24T15:46:45+02:00 git pull origin staging (SSH/key)
fatal: could not read Username for 'https://codemania.yousystems.com': No such device or address
2026-09-24T15:46:45+02:00 ERROR: git pull failed (see last lines in /home/yousystemsnet/public_html/deploy.log)
2026-09-24T15:46:45+02:00 ==== DEPLOY FAILED (Next.js) ====
2026-09-25T07:54:18+00:00 ==== DEPLOY (Next.js) START (user=root app=/home/yousystemsnet/public_html branch=staging) ====
2026-09-25T07:54:18+00:00 git pull origin staging (SSH/key)
fatal: could not read Username for 'https://codemania.yousystems.com': No such device or address
2026-09-25T07:54:18+00:00 ERROR: git pull failed (see last lines in /home/yousystemsnet/public_html/deploy.log)
2026-09-25T07:54:18+00:00 ==== DEPLOY FAILED (Next.js) ====
2026-09-25T08:20:06+00:00 ==== DEPLOY (Next.js) START (user=root app=/home/yousystemsnet/public_html branch=staging) ====
2026-09-25T08:20:06+00:00 git pull origin staging (SSH/key)
fatal: could not read Username for 'https://codemania.yousystems.com': No such device or address
2026-09-25T08:20:06+00:00 ERROR: git pull failed (see last lines in /home/yousystemsnet/public_html/deploy.log)
2026-09-25T08:20:06+00:00 ==== DEPLOY FAILED (Next.js) ====
2026-09-25T09:55:44+00:00 ==== DEPLOY (Next.js) START (user=root app=/home/yousystemsnet/public_html branch=staging) ====
2026-09-25T09:55:44+00:00 git pull origin staging (SSH/key)
fatal: could not read Username for 'https://codemania.yousystems.com': No such device or address
2026-09-25T09:55:44+00:00 ERROR: git pull failed (see last lines in /home/yousystemsnet/public_html/deploy.log)
2026-09-25T09:55:44+00:00 ==== DEPLOY FAILED (Next.js) ====
2026-09-25T11:17:09+00:00 ==== DEPLOY (Next.js) START (user=root app=/home/yousystemsnet/public_html branch=staging) ====
2026-09-25T11:17:09+00:00 git pull origin staging (SSH/key)
fatal: could not read Username for 'https://codemania.yousystems.com': No such device or address
2026-09-25T11:17:09+00:00 ERROR: git pull failed (see last lines in /home/yousystemsnet/public_html/deploy.log)
2026-09-25T11:17:09+00:00 ==== DEPLOY FAILED (Next.js) ====
2026-09-25T11:49:22+00:00 ==== DEPLOY (Next.js) START (user=root app=/home/yousystemsnet/public_html branch=staging) ====
2026-09-25T11:49:22+00:00 git pull origin staging (SSH/key)
fatal: could not read Username for 'https://codemania.yousystems.com': No such device or address
2026-09-25T11:49:22+00:00 ERROR: git pull failed (see last lines in /home/yousystemsnet/public_html/deploy.log)
2026-09-25T11:49:22+00:00 ==== DEPLOY FAILED (Next.js) ====
2026-09-25T12:38:33+00:00 ==== DEPLOY (Next.js) START (user=root app=/home/yousystemsnet/public_html branch=staging) ====
2026-09-25T12:38:33+00:00 git pull origin staging (SSH/key)
fatal: could not read Username for 'https://codemania.yousystems.com': No such device or address
2026-09-25T12:38:33+00:00 ERROR: git pull failed (see last lines in /home/yousystemsnet/public_html/deploy.log)
2026-09-25T12:38:33+00:00 ==== DEPLOY FAILED (Next.js) ====
2026-09-26T10:35:20+00:00 ==== DEPLOY (Next.js) START (user=root app=/home/yousystemsnet/public_html branch=staging) ====
2026-09-26T10:35:20+00:00 git pull origin staging (SSH/key)
fatal: could not read Username for 'https://codemania.yousystems.com': No such device or address
2026-09-26T10:35:20+00:00 ERROR: git pull failed (see last lines in /home/yousystemsnet/public_html/deploy.log)
2026-09-26T10:35:20+00:00 ==== DEPLOY FAILED (Next.js) ====
2026-09-28T09:42:52+00:00 ==== DEPLOY (Next.js) START (user=root app=/home/yousystemsnet/public_html branch=staging) ====
2026-09-28T09:42:52+00:00 git pull origin staging (SSH/key)
fatal: could not read Username for 'https://codemania.yousystems.com': No such device or address
2026-09-28T09:42:52+00:00 ERROR: git pull failed (see last lines in /home/yousystemsnet/public_html/deploy.log)
2026-09-28T09:42:52+00:00 ==== DEPLOY FAILED (Next.js) ====
2026-09-28T12:11:44+00:00 ==== DEPLOY (Next.js) START (user=root app=/home/yousystemsnet/public_html branch=staging) ====
2026-09-28T12:11:44+00:00 git pull origin staging (SSH/key)
fatal: could not read Username for 'https://codemania.yousystems.com': No such device or address
2026-09-28T12:11:44+00:00 ERROR: git pull failed (see last lines in /home/yousystemsnet/public_html/deploy.log)
2026-09-28T12:11:44+00:00 ==== DEPLOY FAILED (Next.js) ====
2026-09-28T14:20:39+00:00 ==== DEPLOY (Next.js) START (user=root app=/home/yousystemsnet/public_html branch=staging) ====
2026-09-28T14:20:39+00:00 git pull origin staging (SSH/key)
fatal: could not read Username for 'https://codemania.yousystems.com': No such device or address
2026-09-28T14:20:39+00:00 ERROR: git pull failed (see last lines in /home/yousystemsnet/public_html/deploy.log)
2026-09-28T14:20:39+00:00 ==== DEPLOY FAILED (Next.js) ====
